Email1,Email2,Fname,Lname,Address1,Address2,City,State,Zip,Country,Phone1,Phone2,Gender1,Gender2,Birthdate,IP,Date1,Date2,Source1,Privacy,IP2,Source2,ID4,ID3,ID2,ID1,NonSup1,NonSup2,NonSup3
007tamaragallett@gmail.com,,Tamara,Nelson,67 Mundt St Apt A,,Denison,TX,75020,,(903) 744-3383,,F,,,159.118.235.189,Oct 3 2014 18:47:30,,,,,,,,,389999996C1E4CB6,,,
0121jlove@gmail.com,,Jennifer,Rodgers,126 Mercer Street,,New Philadelphia,OH,44663,,(330) 827-4912,,F,,,66.87.89.137,Oct 3 2014 14:39:02,,,,,,,,,3899999ABE8D9618,,,
120and10@gmail.com,,Stephanie,Henderson,9426 N 16Th St,,Phoenix,AZ,85020,,(480) 661-6111,,F,,,70.209.102.151,Oct 3 2014 00:18:42,,,,,,,,,4899999B9DE5F413,,,
13waverider69@gmail.com,,Heidi,Edgmon,201 N Liberty St 5,,Port Angeles,WA,98362,,(360) 207-9375,,F,,,24.113.27.147,Oct 3 2014 16:26:17,,,,,,,,,4899999C60EDAFC6,,,
1956pattyhayes@gmail.com,,Patty,Hayes,2709 Lincoln Way West,,Chambersburg,PA,,,(717) 414-2617,,F,,,73.187.192.236,Oct 3 2014 18:53:45,,,,,,,,,48999992EEDD291C,,,
1hothillhippie@gmail.com,,Angie,Oates,33248 Moral Rd,,Wanette,OK,74878,,(405) 593-7169,,F,,,184.20.160.87,Oct 3 2014 19:12:28,,,,,,,,,489999978119E955,,,
1jakeassho@gmail.com,,Stanley,Noe,1901 Spring,,Kansas City,MO,64126,,(816) 206-8664,,M,,,70.195.2.204,Oct 3 2014 20:36:05,,,,,,,,,48999999A18CCC87,,,
1ofakindcolly@cox.net,,Colleen,Reeves,844 E Bell Rd 1100,,Phoenix,AZ,85022,,(602) 774-0446,,F,,,98.177.201.246,Oct 3 2014 15:11:21,,,,,,,,,4899999E92E247FE,,,
21perez05@gmail.com,,Shaydee,Perez,5728 Glendale Ave,,Globe,AZ,85501,,(602) 478-7614,,M,,,174.251.162.211,Oct 3 2014 15:54:58,,,,,,,,,5899999AF02903FA,,,
2lilredheads@gmail.com,,Nicole,Maher,1034 Westward Trails Dr,,Imperial,MO,63052,,(636) 223-2257,,F,,,24.171.5.94,Oct 3 2014 00:32:21,,,,,,,,,5899999BC3990D30,,,
2tonejones@gmail.com,,Antonio,Jones,16001 Homestead,,Dayton,OH,45402,,(937) 271-6675,,M,,,66.87.115.169,Oct 3 2014 13:49:29,,,,,,,,,5899999323B6FC16,,,
315morgan@gmail.com,,Janell,Morgan,315 Rachel Lane,,Middletown,OH,45042,,(513) 571-6407,,F,,,70.208.201.141,Oct 3 2014 06:07:30,,,,,,,,,6899999AEEA01888,,,
3420jayon@gmail.com,,Elizabeth,Gonzalez,288 Nw 6Th St,,Ontario,OR,97914,,(541) 212-8449,,F,,,65.129.6.32,Oct 3 2014 12:55:36,,,,,,,,,6899999DBE7DE04B,,,
3ceci89@gmail.com,,Cecily,Pena,7329 Phillips St Sarasota Fl,,West Sacramento,CA,95691,,(916) 371-1784,,F,,,50.202.27.10,Oct 3 2014 02:37:11,,,,,,,,,68999992E100D276,,,
3jstones@gmail.com,,Jennifer,Stone,20863 Riverterrace Rd,,Petersburg,VA,23803,,(804) 255-4677,,F,,,71.57.205.156,Oct 3 2014 19:26:48,,,,,,,,,68999999C210D6AA,,,
43cnote@comcast.net,,Pat,Franklin,11065 Racetack Rd,,Sonora,CA,95370,,(209) 532-3262,,F,,,71.193.43.207,Oct 3 2014 15:27:18,,,,,,,,,7899999C2FB03618,,,
45withabullet@gmail.com,,Regina,Rocha,9606 E Savile Cir,,Phoenix,AZ,85003,,(480) 528-0338,,F,,,70.209.70.55,Oct 3 2014 20:25:34,,,,,,,,,7899999E606BDEB2,,,
4920phil@gmail.com,,Phil,Mason,428 Clancy St,,Warrensburg,MO,64093,,(787) 563-4198,,M,,,75.133.161.188,Oct 3 2014 16:15:58,,,,,,,,,78999992BE735073,,,
4denton@gmail.com,,Denton,Mcdonald,201 Brumley Drive,,Aubrey,TX,76227,,(940) 367-4140,,M,,,70.196.3.42,Oct 3 2014 08:22:40,,,,,,,,,78999993E1B5EFBA,,,
4kings@wildblue.net,,Robert,King,22685 High Way 36,,Cheshire,OR,97419,,(541) 998-6977,,M,,,184.20.74.207,Oct 3 2014 12:35:43,,,,,,,,,7899999AC3B8876C,,,
4primnarita@gmail.com,,Narita,Prim,5129 Bogart Dr,,Ceres,CA,95307,,(209) 272-7000,,M,,,50.161.185.90,Oct 3 2014 15:38:05,,,,,,,,,7899999F53649ADE,,,
53jhood@gmail.com,,Janice,Hood,3011 Kentucky Court 7,,Atlanta,GA,30344,,(404) 957-1232,,F,,,172.56.1.197,Oct 3 2014 06:18:03,,,,,,,,,8899999C9F56A7FC,,,
664504004arb@gmail.com,,Anthony,Brown,1310 W Main St,,Greenfield,IN,46140,,(571) 302-2824,,M,,,73.176.217.93,Oct 3 2014 16:23:24,,,,,,,,,9899999FDEC79D98,,,
68rosero68@gmail.com,,Mery,Yepez,40-05 College Point Blvd Apt 1B,,Flushing,NY,11354,,(718) 685-9364,,F,,,173.209.212.241,Oct 3 2014 15:52:54,,,,,,,,,9899999110C449C8,,,
69cellphone69@gmail.com,,Ray,Jones,4352 Lincoln Dr,,Moses Lake,WA,98837,,(509) 793-6969,,M,,,173.209.212.148,Oct 3 2014 15:10:10,,,,,,,,,989999922F23793A,,,
70aespinoza@gmail.com,,Adam,Espinoza,58549 Maries Road 206,,Milwaukee,WI,53221,,(414) 840-3784,,M,,,72.128.64.103,Oct 3 2014 00:04:21,,,,,,,,,A99999996D2A567C,,,
76tina3523@gmail.com,,Tina,Hamilton,Pobox 494 Duenweg Mo,,Duenweg,MO,64841,,(417) 456-2093,,F,,,70.195.5.205,Oct 3 2014 16:06:02,,,,,,,,,A999999F3065C665,,,
7785angel@gmail.com,,Melissa,Richart,136 S York Ave,,York,NE,68467,,(402) 710-1147,,F,,,174.253.145.79,Oct 3 2014 04:55:24,,,,,,,,,A99999901ECE52E7,,,
808fiyahboi@gmail.com,,Collins,Hopeau,Po Box 7568 Hilo Hi,,Hilo,HI,96720,,(808) 315-2555,,M,,,204.210.112.34,Oct 3 2014 03:43:02,,,,,,,,,B99999997C3044D1,,,
88bossbob@gmail.com,,Robert,Wright,7 Lawn Street,,Brockton,MA,02302,,(508) 510-4182,,M,,,66.30.123.108,Oct 3 2014 15:08:29,,,,,,,,,B99999911FC42369,,,
90shauntee@gmail.com,,Tenesha,Hughes,11050 Woodmeadow Parkway Apt 1001 Dallas Tx,,Dallas,TX,75228,,(214) 661-0823,,F,,,208.54.86.215,Oct 3 2014 02:01:37,,,,,,,,,C99999998E586D56,,,
a.88habibi@yahoo.com,,Halim,Habibi,,Apt 106 9145 Charleville Beverly Hills CA 90212,Beverly Hills,CA,90212,,(310) 795-0774,,F,,,69.228.162.222,Oct 3 2014 19:42:04,,,,,,,,,189999911E583EF2,,,
a.chris36@ymail.com,,Christopher,Ancira,3301 Mooney Rd,,Houston,TX,77093,,(915) 877-3467,,M,,,108.247.54.101,Oct 3 2014 15:05:48,,,,,,,,,1899999211FA2ED6,,,
a.eduardo51@yahoo.com,,Antonio,Mobile,169 Southview Dr Jupiter Fl,,Jupiter,FL,33458,,(561) 222-3137,,M,,,66.87.95.254,Oct 3 2014 20:07:40,,,,,,,,,18999994D122718C,,,
a.gooding_lpn@yahoo.com,,Ashley,Gooding,Po Box 358,,Dierks,AR,71833,,(479) 871-7070,,F,,,67.61.110.33,Oct 3 2014 00:54:40,,,,,,,,,1899999681C5EBA6,,,
a.kgreen97@yahoo.com,,Andrea,Green,3790 W Jett Rd,,San Antonio,TX,78264,,(210) 241-8389,,F,,,66.87.120.20,Oct 3 2014 20:38:11,,,,,,,,,1899999AA3F6AB6E,,,
a.maciel1015@gmail.com,,Adrian,Maciel,908 Jean St,,San Antonio,TX,78207,,(210) 918-0579,,M,,,108.200.126.47,Oct 3 2014 16:55:09,,,,,,,,,1899999C42000561,,,
a.unapologeticgirl@gmail.com,,Nakiah,,3718 Marshlane Way,,Raleigh,NC,27610,,(919) 772-2268,,F,,,98.69.236.240,Oct 3 2014 15:46:16,,,,,,,,,1899999413E7AFEA,,,
a5150vegasgirl@gmail.com,,Kristen,Menagh,2215 Westwood Northern Blvd,,Downey,CA,90241,,(562) 746-3211,,F,,,71.103.84.239,Oct 3 2014 13:43:52,,,,,,,,,8899999AEE792ECC,,,
aahmedfields@gmail.com,,Atiya,Ahmed-Fields,24 Deer Park Dr,,Philadelphia,PA,19131,,(215) 879-7936,,F,,,98.115.138.18,Oct 3 2014 13:38:40,,,,,,,,,C6B99C23FCFCEA2E,,,
aaitarajtamang1994@gmail.com,,,Tamang,4407 Kern Court Apt 01,,Louisville,KY,40218,,(502) 294-3907,,M,,,172.56.1.56,Oct 3 2014 18:54:29,,,,,,,,,D67EE1F420FB80C4,,,
aanda5@icloud.com,,Aaron,Hinckley,5205 West Thunderbird Rd,,Glendale,AZ,85306,,(623) 806-6917,,M,,,68.228.60.87,Oct 3 2014 11:06:37,,,,,,,,,FCCC76A7809D562A,,,
aaronconey@yahoo.com,,Aaron,Coney,425 Stoll Poole Ct,,Lexington,KY,40508,,(859) 312-7269,,M,,,74.138.91.125,Oct 3 2014 18:51:57,,,,,,,,,261069E4FD62DC26,,,
aaronleivan@yahoo.com,,Aaron,Leivan,1400 Mill St,,Lamar,MO,64759,,(417) 682-5370,,M,,,66.87.75.218,Oct 3 2014 12:58:50,,,,,,,,,2619C4F63E762DC2,,,
aaronmtull357@gmail.com,,Aaron,Tull,2132 Septiembre,,Kansas City,KS,66101,,(913) 217-7837,,M,,,65.28.70.203,Oct 3 2014 21:12:46,,,,,,,,,261A54DDBACE744C,,,
aaweinfu@gmail.com,,Alyssa,Weinfurtner,62 Pleasant St,,Cleveland,OH,44111,,(216) 496-3816,,F,,,174.21.185.240,Oct 3 2014 01:23:15,,,,,,,,,AE651EFCEA2E91C1,,,
abbydawg12@gmail.com,,Abby,Bellanger,,,Osage,MN,21556,,(218) 573-3954,,F,,,207.191.151.226,Oct 3 2014 06:03:48,,,,,,,,,5CBC0CAE9E90E071,,,
abbygreene@aol.com,,Abby,Greene,1454 E Nighthawk Way,,Phoenix,AZ,85048,,(732) 447-8299,,F,,,24.24.168.203,Oct 3 2014 02:02:05,,,,,,,,,49999991B16872EB,,,
abbyngo2001@yahoo.com,,Abby,Ngo,305 Sw Churchhill Downs,,Albany,OR,97322,,(541) 908-2764,,F,,,71.215.189.40,Oct 3 2014 08:19:06,,,,,,,,,49999991B16F6695,,,
abdulhady_ahmed@hotmail.com,,Ahmed,Diab,,,Saratoga,CA,95070,,(972) 454-1111,,M,,,107.178.37.38,Oct 3 2014 11:36:57,,,,,,,,,789FCD44DEF8EF5B,,,
aberczelly@gmail.com,,Andrew,Mobile,422 Carters Grove Road,,Dayton,OH,45459,,(937) 604-7074,,M,,,108.240.90.206,Oct 3 2014 20:22:01,,,,,,,,,8501A9565744C273,,,
ablkjr@gmail.com,,Aaron,Blackhawk,4950 N 19Th Pl,,Milwaukee,WI,53209,,(414) 343-9762,,M,,,174.251.1.70,Oct 3 2014 18:53:25,,,,,,,,,F81DDCC0E071AC80,,,
acampbell4566@gmail.com,,Aaron,Campbell,539 Briar Branch Rd,,Jesup,GA,31545,,(912) 402-2136,,M,,,73.48.71.160,Oct 3 2014 03:35:20,,,,,,,,,E4B5AB095677182E,,,
accdc_20@yahoo.com,,Rachel,Spencer,1630 Iliff Ave,,Hamilton,OH,45025,,(513) 362-9023,,F,,,69.171.163.28,Oct 3 2014 16:00:50,,,,,,,,,0BE8D750AEFA278D,,,
aceegoldiee@gmail.com,,Linda,,156 Birch St,,Stafford,TX,77477,,(832) 947-8189,,F,,,172.56.9.243,Oct 3 2014 00:12:59,,,,,,,,,2C287FC6C0384964,,,
acgorleysr@yahoo.com,,Antralon,Cavour,1162 Arlington Ave Sw,,Richlands,NC,28574,,(910) 430-0498,,F,,,75.136.158.140,Oct 3 2014 16:11:48,,,,,,,,,46DF422039645BC0,,,
achase0054@yahoo.com,,Andrew,Chase,5740 Cavaliero Drive,,Erie,PA,16511,,(814) 490-1416,,M,,,147.64.138.251,Oct 3 2014 02:42:28,,,,,,,,,5844138FB762DC26,,,
acolon52@gmail.com,,Armando,Colon,1611 Capitola St,,Santa Maria,CA,93458,,(805) 260-8682,,M,,,70.197.11.247,Oct 3 2014 13:35:21,,,,,,,,,CDEF09564E7C9FAA,,,
acorbin74@yahoo.com,,Alan,Corbin,2212 S Lombard Ave,,Winchester,VA,22638,,(540) 431-7444,,M,,,73.171.78.253,Oct 3 2014 14:09:18,,,,,,,,,C310B8B980EFA278,,,
adam_erich@outlook.com,,Francis,Osunde,5 Eweka Drive Off Goodwill Benin City Edo State Nigeria,,Virginia Beach,VA,23452,,(234) 813-8147,,M,,,64.150.177.242,Oct 3 2014 18:54:29,,,,,,,,,8EECF8C0F5E65B96,,,
adamgeschwind2012@gmail.com,,Adam,Mobile,1826 Kingston Ave,,Norfolk,VA,23503,,(513) 413-8605,,M,,,70.160.104.233,Oct 3 2014 14:41:54,,,,,,,,,8E6C086B4AD53723,,,
adamlayne0731@gmail.com,,Adam,Layne,2418 Melody Lane,,Anderson,IN,46012,,,,M,,,73.176.32.177,Oct 3 2014 00:02:29,,,,,,,,1331240021,8EB20AB6FAE85E90,,,
adamrobinson82@gmail.com,,Adam,Robinson,14311 Se Mill Plain Blvd,,Vancouver,WA,98684,,(503) 889-5586,,M,,,70.210.158.249,Oct 3 2014 13:08:04,,,,,,,,,8E103A65E2D519E9,,,
adamscamari@yahoo.com,,Seneca,Gause,721 W Leaf Land,,Decatur,IL,62526,,(217) 454-2680,,M,,,98.214.209.184,Oct 3 2014 01:18:52,,,,,,,,,8E24880E943ACC56,,,
adamson187@comcast.net,,Adamson,,60 Emerson St,,Homer City,PA,15748,,(724) 479-9673,,F,,,71.236.99.102,Oct 3 2014 16:14:06,,,,,,,,,8E20FB88362CE286,,,
addicted0905@hotmail.com,,Bianca,Ruland,4840 Pine St Philadelphia Pa 19143,,Philadelphia,PA,19143,,(973) 768-8883,,F,,,69.253.18.164,Oct 3 2014 15:12:28,,,,,,,,,B4CFAE11ABA95815,,,
addisondenia@yahoo.com,,Denia,Addison,,,Garden City,MI,48135,,(313) 925-5030,,F,,,24.11.35.159,Oct 3 2014 18:54:29,,,,,,,,,B4C4D01C92C5B62D,,,
addisontamika@yahoo.com,,Tamika,Addison,148 Glenwood Rd Dillsburg Pa,,Baltimore,MD,21231,,(410) 276-1167,,F,,,173.67.58.33,Oct 3 2014 17:14:19,,,,,,,,,B4C4D012264E4762,,,
adicus44@hotmail.com,,Nick,Allen,1378 N Freedom Blvd,,Provo,UT,84601,,(801) 562-8898,,M,,,107.188.151.23,Oct 3 2014 12:39:29,,,,,,,,,0EE8DEB756F00219,,,
admiredsuccess@gmail.com,,Sharonda,Duncan,210 Matthews Avenue Apt 502,,Carrollton,GA,30117,,(404) 369-9034,,F,,,172.56.0.141,Oct 3 2014 18:08:52,,,,,,,,,44BA3F062A2760BC,,,
admirekelsey@gmail.com,,Kelsey,Admire,5495 A St 7,,Springfield,OR,97478,,(541) 606-9766,,F,,,204.16.69.170,Oct 3 2014 16:36:43,,,,,,,,,44BAA023E8E3044C,,,
adnanwashington@yahoo.com,,Adnan,Washington,3 Doray Ct,,Windsor Mill,MD,21244,,(443) 985-6517,,M,,,166.137.89.166,Oct 3 2014 13:47:38,,,,,,,,,5C726D09EBA67CF9,,,
adog4poison@yahoo.com,,Carlena,Bradshaw,800 S 4 Th Ave Apt 313,,Richmond,VA,23234,,(804) 237-2161,,F,,,50.134.37.74,Oct 3 2014 16:49:47,,,,,,,,,6277C8C00DB0AEFA,,,
adonahue@aol.com,,Anne,Donahue,17 Pickwick Rd,,Syracuse,NY,13214,,(315) 446-2860,,F,,,74.67.235.71,Oct 3 2014 08:52:36,,,,,,,,,69A30D212491C1CE,,,
adrennen7@comcast.net,,Amy,Drennen,1715 Pearson St,,Philadelphia,PA,19115,,(215) 620-3351,,F,,,76.98.151.49,Oct 3 2014 03:29:21,,,,,,,,,90790CB2526A8605,,,
adrianagrnr71@gmail.com,,Xochitl,Granera,9993 Triple Crown Cir,,Orlando,FL,32825,,(407) 480-1659,,F,,,66.87.110.44,Oct 3 2014 18:35:24,,,,,,,,,94A9CC499B66A744,,,
adriandenee19@gmail.com,,Adrian,Oliver,16400 Noracle Rd,,Charleston,SC,29414,,(843) 530-2581,,M,,,68.58.222.178,Oct 3 2014 15:45:22,,,,,,,,,94A9FC250E6A8E90,,,
adrianvela007@gmail.com,,Adrian,Vela,7127 E Paseo San Andres,,Clinton,OK,73601,,(580) 309-1938,,M,,,24.117.57.32,Oct 3 2014 05:35:10,,,,,,,,,94A91D23C31AD244,,,
adrianvl8788@gmail.com,,Adrian,Ulloa,145 Pearl Lake Cause Way 200,,Morris,IL,60450,,(815) 710-0187,,M,,,108.255.26.150,Oct 3 2014 16:20:30,,,,,,,,,94A91D99899182E2,,,
adsma35@gmail.com,,Adam,Smith,595 C St,,David City,NE,68632,,(402) 367-2279,,M,,,166.182.81.42,Oct 3 2014 08:14:59,,,,,,,,,A2E68F744C273A06,,,
advocate.lua@gmail.com,,Lucilla,Najera,8753 Plains,,El Paso,TX,79907,,(915) 820-7309,,F,,,205.197.242.184,Oct 3 2014 02:11:34,,,,,,,,,D40A152F304FCEA2,,,
ady2me007@yahoo.com,ady2me007@yahoocom,Ady,Shawn,,,Kendallville,IN,46755,,(260) 347-0012,,M,,,64.184.36.157,Oct 3 2014 03:49:28,,,,,,,,,01605A7784256ABE,,,
adz_elk@yahoo.com,,Alan,Zoller,6417 31St,,Lubbock,TX,79407,,(806) 789-1637,,M,,,66.249.85.75,Oct 3 2014 18:08:46,,,,,,,,,1481A0762DC2662A,,,
aellis8587@gmail.com,,Ashley,Ellis,1911 Golf Lane,,Toledo,OH,43612,,(419) 470-9277,,F,,,134.228.34.26,Oct 3 2014 01:18:52,,,,,,,,,DBA4BFCFE744C273,,,
aeritheres93@gmail.com,,Aerial,Hillard,511 Coombs,,Williamsport,PA,17701,,(570) 447-1396,,F,,,216.37.198.7,Oct 3 2014 19:49:55,,,,,,,,,38BF9852A861A60E,,,
afields.ibo@outlook.com,,Andre,Fields,739 Tilden Avenue,,Bel Air,MD,21014,,(443) 682-4141,,M,,,75.109.210.143,Oct 3 2014 17:44:47,,,,,,,,,4E7FC09A1676225B,,,
afolabi_alli@hotmail.com,,Justin,Mobile,13007 Merrick Blvd,,Jamaica,NY,11434,,(917) 683-0233,,M,,,96.224.87.101,Oct 3 2014 15:42:50,,,,,,,,,AF0B16621927356F,,,
aforty7@gmail.com,,Abimael,Forty,185 Street Km 10.9,,Canovanas,PR,,,(787) 460-0617,,M,,,38.87.238.233,Oct 3 2014 17:41:48,,,,,,,,,A53C4E744C273A06,,,
afshin_optic86@yahoo.com,,Afshin,Shokohi,,,Schenectady,NY,12345,,(914) 906-1929,,M,,,65.49.68.179,Oct 3 2014 18:53:25,,,,,,,,,EB871C6B78C1FD76,,,
afunchess29@gmail.com,,Amber,Funchess,3624 Columbus Ave 3,,Minneapolis,MN,55407,,(612) 267-0160,,F,,,97.116.90.58,Oct 3 2014 18:19:25,,,,,,,,,012112A8985B44C2,,,
agarcia102379@gmail.com,,Athena,Garcia,Po Box 2575,,Merced,CA,95344,,(209) 947-2151,,F,,,205.197.242.166,Oct 3 2014 20:22:20,,,,,,,,,65221E21348ABCA4,,,
agarcia1095@aol.com,,Amanda,Garcia,2420 Grand Avenue Apt B1,,Bronx,NY,10468,,(646) 606-7878,,F,,,71.190.86.108,Oct 3 2014 04:05:22,,,,,,,,,65221E21A0506976,,,
ageem89@gmail.com,,Michael,Agee,Po Box 276,,Cleveland,OH,44111,,(216) 548-3793,,M,,,205.197.242.149,Oct 3 2014 14:15:16,,,,,,,,,A26F30744C273A06,,,
ageyer247@gmail.com,,Amanda,Geyer,4035 Willshire Court,,Fort Wayne,IN,46815,,(260) 918-8855,,F,,,184.17.210.63,Oct 3 2014 16:13:38,,,,,,,,,A6855907661E071A,,,
agonzalezortiz@hotmail.com,,Ana,Gonzalez,42 Erwin Pl Apt 3,,New Britain,CT,06051,,(860) 505-8245,,F,,,76.127.145.65,Oct 3 2014 12:27:51,,,,,,,,,4BD794214F76C7BD,,,
aguilar2948@gmail.com,,Maria,Espindola,4927 South Denley Drive,,Dallas,TX,75216,,(972) 997-1376,,F,,,172.56.6.163,Oct 3 2014 17:32:11,,,,,,,,,A097F59FF6E90E07,,,
ahalfbreed@gmail.com,,Sheri,Burk,1441 Carol Dr,,Memphis,TN,38116,,(901) 262-2063,,F,,,66.249.83.56,Oct 3 2014 04:21:33,,,,,,,,,0337552CF3849649,,,
ahenley31@gmail.com,,Ami,Henley,233 Clift View Dr,,Chattanooga,TN,37415,,(423) 320-3004,,F,,,68.169.154.75,Oct 3 2014 12:15:17,,,,,,,,,45978C42182E2945,,,
ahmadtnajem@yahoo.com,,Ahmad,Najem,4950 Owens De,,Pleasanton,CA,94588,,(408) 480-8387,,M,,,50.156.10.117,Oct 3 2014 14:42:13,,,,,,,,,C2B97B2F267362DC,,,
aideaguirre82.aa@gmail.com,,Alejandra,,1213 Colorado,,Alamo,TX,78516,,(956) 223-0343,,F,,,66.87.121.139,Oct 3 2014 13:02:35,,,,,,,,,D0CC4CEF56831A1E,,,
aimeedonahue7@gmail.com,,Aimee,Donahue,3674 Creek Road,,Chaska,MN,55318,,(612) 750-4100,,F,,,76.164.143.145,Oct 3 2014 14:42:37,,,,,,,,,600C169A30D28182,,,
aiza.alberto@ymail.com,,Aiza,Alberto,46 Mc Aree Rd Apt 2 Waukegan Il 60085,,Highland Park,IL,60035,,(224) 656-0625,,M,,,76.29.126.100,Oct 3 2014 19:28:34,,,,,,,,,36DCE3DED9ECBE4E,,,
aizhayoung1@gmail.com,,Young,,113 N 16Th Street Apt 2,,East Orange,NJ,07017,,(862) 444-0351,,M,,,66.249.83.56,Oct 3 2014 13:31:43,,,,,,,,,3D0F604F8A8E90E0,,,
ajcampos23@gmail.com,,Andrew,Campos,515 Arroyo Grande Ln,,Suisun City,CA,94585,,(650) 784-9411,,M,,,50.185.193.199,Oct 3 2014 19:36:11,,,,,,,,,662ED02DA6E90E07,,,
ajfivellc@yahoo.com,,Jay,Crawford,210 N Pine St,,Blue Hill,NE,68930,,(402) 984-2815,,M,,,70.198.2.215,Oct 3 2014 14:55:03,,,,,,,,,9E50237C5ACEFA27,,,
ajkibler@hotmail.com,,Amy,Kibler,160 Ellis St Apt G,,Vonore,TN,37885,,(865) 317-2790,,F,,,69.131.245.176,Oct 3 2014 17:56:45,,,,,,,,,E8B19CDDDE01E009,,,
ajnzwatson@yahoo.com,,Ashley,Watson,1454 S 4Th St,,Columbus,OH,43207,,(614) 512-1507,,F,,,172.56.13.237,Oct 3 2014 02:54:30,,,,,,,,,19A4EB8C160AEFA2,,,
ajohnso26@gmail.com,,Ashley,Johnson,2625 Charlestown Drive 16A,,Charlotte,NC,28209,,(980) 219-7494,,F,,,75.190.129.157,Oct 3 2014 01:06:08,,,,,,,,,277100BD96FA2E91,,,
ajpeanut08@gmail.com,,Joseph,Ferrer,4894 Liberty Lane,,Macungie,PA,18062,,(973) 558-9225,,M,,,70.15.24.123,Oct 3 2014 12:26:56,,,,,,,,,499999999128F45B,,,
ajwillia213@gmail.com,,Andrea,Petry,1090 Peyton Dr,,Beaumont,TX,77706,,(409) 998-5349,,F,,,72.191.99.29,Oct 3 2014 02:48:38,,,,,,,,,49999999026372C7,,,
akeylabri@gmail.com,,Akeyla,Whipple,5336 White Cliff Ln Unit 1,,Bethesda,MD,20817,,(240) 418-0262,,M,,,66.87.81.93,Oct 3 2014 03:03:46,,,,,,,,,225FE9381A60E071,,,
akhnot@live.com,,Angelo,Hadnot,902 Cedar Creek Dr Wylie,,Wylie,TX,75098,,(469) 744-2466,,M,,,70.196.9.134,Oct 3 2014 01:40:17,,,,,,,,,57C51B16F5862A53,,,
akmakani38@outlook.com,,Andy,Carr,14337 32Nd Ave Ne 101,,Seattle,WA,98125,,(206) 362-3428,,M,,,174.21.49.106,Oct 3 2014 10:21:34,,,,,,,,,A45EE546932325B0,,,
akocharian123@hotmail.com,,Alfred,Kocharian,8512 Verbena Dr,,Riverside,CA,92504,,(951) 235-1009,,M,,,68.119.157.73,Oct 3 2014 16:37:30,,,,,,,,,C65BE94A96A9FBE7,,,
akprue@gmail.com,,Kristen,Prue,5616 Pope Rd,,Fort Belvoir,VA,22060,,(702) 672-7227,,F,,,108.45.128.58,Oct 3 2014 16:14:57,,,,,,,,,D5682182E294562A,,,
alacrunck4life@yahoo.com,,Mercedes,Ryles,3351 N Lumpkin Rd Apt 320I,,Columbus,GA,31903,,(706) 575-2039,,F,,,24.96.76.53,Oct 3 2014 03:19:11,,,,,,,,,86552F22B6F6D03A,,,
alanafitch@gmail.com,,Alana,Fitch,616 Orange Ave,,Alpharetta,GA,30201,,(678) 722-1113,,F,,,70.193.136.210,Oct 3 2014 02:39:03,,,,,,,,,816346B8B96FA2E9,,,
alanwroles@yahoo.com,,Alan,Roles,2208 Wynnewood Circle,,Louisville,KY,40222,,(502) 930-1462,,M,,,184.45.68.236,Oct 3 2014 00:54:40,,,,,,,,,816A9AF4C2762DC2,,,
albattleii@yahoo.com,,Alvin,Battle,1306 Legend Place,,Stafford,TX,77477,,(832) 987-6855,,M,,,107.213.84.93,Oct 3 2014 20:35:44,,,,,,,,,94571D40670AEFA2,,,
albertcannon9215@gmail.com,,Elbert,Cannon,1000 Witherspoon,,Baltimore,MD,21212,,(443) 400-9215,,M,,,172.56.2.164,Oct 3 2014 14:57:09,,,,,,,,,98551461D23B4708,,,
albertoragsdale657@gmail.com,,Jorge,Fuentes,13807 Nubia St,,Baldwin Park,CA,91706,,(626) 210-7933,,M,,,172.249.77.203,Oct 3 2014 17:55:51,,,,,,,,,4999999B5229F210,,,
albertpico@ymail.com,,Albert,Pico,3220 Sw 126 Ave,,Miami,FL,33175,,(786) 399-4007,,M,,,108.249.166.217,Oct 3 2014 07:43:23,,,,,,,,,9855118AC80AA2E9,,,
alcantarlinda67@gmail.com,,Linda,Alcantar,81- F Rome Street Hartwell Ga,,Denver,CO,80202,,(720) 275-9240,,F,,,69.171.160.8,Oct 3 2014 17:28:07,,,,,,,,,AE7112792B5181C9,,,
alejandra_ramirez0121@yahoo.com,,Patrick,Lawson,Po Box 374,,Okeechobee,FL,34973,,(863) 763-3349,,M,,,71.3.52.242,Oct 3 2014 17:18:49,,,,,,,,,C77B519C832AAA16,,,
alekomarshall@gmail.com,,Aleko,Marshall,24819 Country Oaks Blvd,,Saint Francisville,LA,70775,,(225) 721-2852,,F,,,107.77.80.31,Oct 3 2014 04:47:55,,,,,,,,,C872A270B6949182,,,
alenanally62@gmail.com,,Alena,Nally,Po Box 91,,Dixie,WA,99329,,(509) 301-8755,,F,,,68.189.131.136,Oct 3 2014 03:15:54,,,,,,,,,CB8B5E37257A744C,,,
alex.middleton24@gmail.com,,Alexandra,Middleton,2513 Paddock Ln,,Louisville,KY,40216,,(502) 751-6671,,F,,,96.28.86.121,Oct 3 2014 00:53:41,,,,,,,,,C5806BF50FDCFBB9,,,
alex296076@yahoo.com,,Ignacio,Garcia,2970 66Th Ave Ne Naplles Fl,,Naples,FL,34120,,(239) 601-3942,,M,,,71.52.171.85,Oct 3 2014 17:06:04,,,,,,,,,C58EF76BB762DC26,,,
alex8146@bellsouth.net,,Henry,Alexander,613 Wesleylne,,Mobile,AL,36609,,(251) 209-9811,,M,,,107.196.60.238,Oct 3 2014 00:07:28,,,,,,,,,4999999BEF5F8F7B,,,
alexaer559@gmail.com,,Alex,Anthony,1151 S Chestnut,,Fresno,CA,93702,,(559) 708-8486,,M,,,73.48.141.114,Oct 3 2014 18:15:26,,,,,,,,,C5824F0A27661E07,,,
alexander1mia@yahoo.com,,Mia,Alexander,112 Susan Dr,,Buda,TX,78610,,(512) 317-2209,,F,,,72.182.82.59,Oct 3 2014 13:43:52,,,,,,,,,C58B51CDE84CE1AA,,,
alexanderhenley99@gmail.com,,Alexander,Henley,213 New Alexandria Road,,Mobile,FL,,,(813) 900-6603,,M,,,72.77.182.230,Oct 3 2014 16:11:33,,,,,,,,,C58B51CDB4719C46,,,
alexandriawilliams27@yahoo.com,,Alexandria,Riley,,,Meridian,GA,31319,,(912) 437-4808,,F,,,173.209.211.206,Oct 3 2014 16:36:43,,,,,,,,,C58B5194A2EE934A,,,
alexb7799@aol.com,,Alex,Baker,625 Morgan Hills Dr,,Lexington,KY,40509,,(407) 949-1244,,M,,,71.47.157.204,Oct 3 2014 10:40:02,,,,,,,,,C585E22E7E671AC8,,,
alexcrawford405@gmail.com,,Alex,Crawford,6 Manor Hills Dr Manorville Ny,,Covington,KY,41011,,(859) 760-8524,,M,,,74.139.115.64,Oct 3 2014 06:18:38,,,,,,,,,C5865EEBC5679258,,,
alexfortier83@yahoo.com,,Alex,Fortier,14 Hudson Pl,,East Bridgewater,MA,02333,,(508) 663-9345,,M,,,76.119.99.57,Oct 3 2014 16:17:09,,,,,,,,,C5892F58CF843C4E,,,
alexiainvenice@gmail.com,,Rita,Kreider,1117 Gulf Coast Blvd,,Venice,FL,34285,,(941) 716-0658,,F,,,68.56.79.47,Oct 3 2014 12:41:20,,,,,,,,,C58CE09FAD06A038,,,
alexluongo9@yahoo.com,,Alex,Luongo,22 Barry Way,,Trenton,NJ,08619,,(609) 915-3493,,M,,,70.215.65.2,Oct 3 2014 04:05:22,,,,,,,,,C58F20D869B0AEFA,,,
alexsyl76@hotmail.com,,Alex,Sylvestre,Po Box 22016,,,,,,(832) 591-6191,,M,,,172.3.115.56,Oct 3 2014 04:05:22,,,,,,,,,C5866D0D97FC5C20,,,
alexuaw@gmail.com,,Wright,Mobile,619 Carolyn Rd,,Fayetteville,NC,28301,,(910) 551-2833,,M,,,66.87.133.126,Oct 3 2014 20:06:35,,,,,,,,,C588EEFAC4263382,,,
alexusdjr@gmail.com,,Reynolds,Mobile,85 Lanfair,,Cheltenham,PA,19012,,(215) 779-3868,,F,,,70.192.137.66,Oct 3 2014 20:35:44,,,,,,,,,4999999B82562519,,,
alexwhttn@gmail.com,,Buddy,Wayne,207 Mary St,,Haleyville,AL,35565,,(205) 494-3462,,M,,,174.237.128.52,Oct 3 2014 02:19:51,,,,,,,,,C58AFF7DD244C273,,,
alexy4563@gmail.com,,Sergio,Guandique,8336 Claremont Woods Dr,,Alexandria,VA,22309,,(571) 241-4765,,M,,,173.209.211.242,Oct 3 2014 20:22:20,,,,,,,,,C58C5674182E2945,,,
alfredmurray2010@gmail.com,,Alfred,Murray,2190 Ambleside Drive Apt913,,Cleveland,OH,44106,,(216) 571-7757,,M,,,76.189.121.59,Oct 3 2014 13:17:22,,,,,,,,,DF887023120A9211,,,
alian777333@yahoo.com,,Alian,Ruiz,2025 Longwood Rd,,West Palm Beach,FL,33409,,(561) 460-2533,,F,,,50.154.165.208,Oct 3 2014 02:09:40,,,,,,,,,0E71EEEAAA762DC2,,,
aliasmark@msn.com,,Mark,Ramp,2929 Routier Road 234,,Sacramento,CA,95827,,(310) 500-7898,,M,,,24.10.110.70,Oct 3 2014 05:49:01,,,,,,,,,0E76A2783030F764,,,
alicia_johnson2000@yahoo.com,,Alicia,Johnson,N 650 State High Way 187,,Dayton,OH,45402,,(937) 559-5526,,F,,,174.101.215.201,Oct 3 2014 18:56:35,,,,,,,,,007CE6BE9596CFB7,,,
aliciabilindo@yahoo.com,,Alicia,,1359 Avoca Place Apt 1,,Sheridan,WY,82801,,(307) 683-7172,,F,,,184.167.103.13,Oct 3 2014 04:50:22,,,,,,,,,007CE9ABAFB16582,,,
aliciabrothers68@yahoo.com,,Alicia,Brothers,1911 N Winstel Blvd,,Tucson,AZ,85716,,(520) 549-8095,,F,,,24.255.33.170,Oct 3 2014 09:52:59,,,,,,,,,007CE93E59A29E3D,,,